Update Dr. CI comments #55024
update-drci-comments.yml
on: schedule
update-drci-comments
2m 4s
Annotations
2 errors and 1 warning
update-drci-comments
Process completed with exit code 1."],"failure_context":["+ python3 .github/scripts/get_workflow_job_id.py 8349997816 worker-rocm-amd-36","+ tar -xvz -C /usr/temp_pb_install_dir --strip-components 1 -f protobuf-all-3.17.3.tar.gz","+ curl -LO https://github.com/protocolbuffers/protobuf/releases/download/v3.17.3/protobuf-all-3.17.3.tar.gz --retry 3","+ ln -s /usr/lib64 /usr/temp_pb_install_dir/lib64","+ mkdir -p /usr/temp_pb_install_dir","+ pb_dir=/usr/temp_pb_install_dir","+ install_protobuf_317","+ rm -rf /var/lib/apt/lists/archive.ubuntu.com_ubuntu_dists_focal-backports_InRelease /var/lib/apt/lists/archive.ubuntu.com_ubuntu_dists_focal-backports_main_binary-amd64_Packages.lz4 /var/lib/apt/lists/archive.ubuntu.com_ubuntu_dists_focal-backports_universe_binary-amd64_Packages.lz4 /var/lib/apt/lists/archive.ubuntu.com_ubuntu_dists_focal-updates_InRelease /var/lib/apt/lists/archive.ubuntu.com_ubuntu_dists_focal-updates_main_binary-amd64_Packages.lz4 /var/lib/apt/lists/archive.ubuntu.com_ubuntu_dists_focal-updates_multiverse_binary-amd64_Packages.lz4 /var/lib/apt/lists/archive.ubuntu.com_ubuntu_dists_focal-updates_restricted_binary-amd64_Packages.lz4 /var/lib/apt/lists/archive.ubuntu.com_ubuntu_dists_focal-updates_universe_binary-amd64_Packages.lz4 /var/lib/apt/lists/archive.ubuntu.com_ubuntu_dists_focal_InRelease /var/lib/apt/lists/archive.ubuntu.com_ubuntu_dists_focal_main_binary-amd64_Packages.lz4 /var/lib/apt/lists/archive.ubuntu.com_ubuntu_dists_focal_multiverse_binary-amd64_Packages.lz4 /var/lib/apt/lists/archive.ubuntu.com_ubuntu_dists_focal_restricted_binary-amd64_Packages.lz4 /var/lib/apt/lists/archive.ubuntu.com_ubuntu_dists_focal_universe_binary-amd64_Packages.lz4 /var/lib/apt/lists/auxfiles /var/lib/apt/lists/lock /var/lib/apt/lists/partial /var/lib/apt/lists/ppa.launchpad.net_ubuntu-toolchain-r_test_ubuntu_dists_focal_InRelease /var/lib/apt/lists/ppa.launchpad.net_ubuntu-toolchain-r_test_ubuntu_dists_focal_main_binary-amd64_Packages.lz4 /var/lib/apt/lists/security.ubuntu.com_ubuntu_dists_focal-security_InRelease /var/lib/apt/lists/security.ubuntu.com_ubuntu_dists_focal-security_main_binary-amd64_Packages.lz4 /var/lib/apt/lists/security.ubuntu.com_ubuntu_dists_focal-security_multiverse_binary-amd64_Packages.lz4 /var/lib/apt/lists/security.ubuntu.com_ubuntu_dists_focal-security_restricted_binary-amd64_Packages.lz4 /var/lib/apt/lists/security.ubuntu.com_ubuntu_dists_focal-security_universe_binary-amd64_Packages.lz4 '/tmp/*' '/var/tmp/*'","+ apt-get clean","+ apt-get autoclean","+ [[ 20.04 == 14.04 ]]","+ apt-get update"],"time":"2024-03-19T23:18:46.953470Z"}],"FLAKY":[{"workflowId":8349997781,"id":22859145937,"runnerName":"i-0d727475439ee1356","authorEmail":"peterbell10@live.co.uk","name":"linux-binary-manywheel / manywheel-py3_8-cuda12_1-build / build","jobName":"manywheel-py3_8-cuda12_1-build / build","conclusion":"failure","completed_at":"2024-03-19T23:16:27Z","html_url":"https://github.com/pytorch/pytorch/actions/runs/8349997781/job/22859145937","head_branch":"ciflow/trunk/109913","pr_number":109913,"head_sha":"93fec8e310f55a4e6fb5d78eb752c234ea0ed0b1","failure_captures":["../aten/src/ATen/native/sparse/cuda/cuSPARSELtOps.cpp:151:24: error: ‘CUSPARSE_COMPUTE_TF32’ was not declared in this scope; did you mean ‘CUSPARSE_COMPUTE_32F’?"],"failure_lines":["../aten/src/ATen/native/sparse/cuda/cuSPARSELtOps.cpp:151:24: error: ‘CUSPARSE_COMPUTE_TF32’ was not declared in this scope; did you mean ‘CUSPARSE_COMPUTE_32F’?"],"failure_context":["++ python setup.py bdist_wheel -d /tmp/wheelhouse121","++ USE_KINETO=1","++ USE_RCCL=1","++ USE_NCCL=1","++ BUILD_LIBTORCH_CPU_WITH_DEBUG=0","++ EXTRA_CAFFE2_CMAKE_FLAGS=-DATEN_NO_TEST=ON","++ CMAKE_ARGS=","++ echo 'Calling setup.py bdist at Tue Mar 19 23:07:56 UTC 2024'","+++ date","++ USE_KINETO=1","++ USE_NCCL=1","++ USE_RCCL=1"],"time":"2024-03-19T23:16:31.895405Z"},{"workflowId":8349995929,"id":22857311741,"runnerName":"i-06366628924f4e2a0","authorEmail":"peterbell10@live.co.uk","name":"pull / linux-focal-py3.11-clang10 / test (crossref, 1, 2, linux.2xlarge)","jobName":"linux-foca
|
update-drci-comments
Process completed with exit code 1."],"failure_context":[],"time":"2024-03-21T21:25:42.487194Z"},{"workflowId":8381809113,"id":22954217767,"runnerName":"GitHub Actions 131","authorEmail":"vmoens@meta.com","name":"Continuous Benchmark / CPU Pytest benchmark","jobName":"CPU Pytest benchmark","conclusion":"failure","completed_at":"2024-03-21T21:28:15Z","html_url":"https://github.com/pytorch/rl/actions/runs/8381809113/job/22954217767","head_branch":"fix-nonblocking-once-more","pr_number":2034,"head_sha":"14c7af95666e74335f34ec1ab1eb5acb10e1663f","failure_captures":["RuntimeError: Could not find a sync function. Please report this in a Github issue and/or set non_blocking=False."],"failure_lines":["RuntimeError: Could not find a sync function. Please report this in a Github issue and/or set non_blocking=False."],"failure_context":[],"time":"2024-03-21T21:28:19.473253Z"},{"workflowId":8381809187,"id":22954210899,"runnerName":"i-0807aaa89152d5d1f","authorEmail":"vmoens@meta.com","name":"Generate documentation / build-docs (3.9, 12.1) / linux-job","jobName":"build-docs (3.9, 12.1) / linux-job","conclusion":"failure","completed_at":"2024-03-21T23:15:35Z","html_url":"https://github.com/pytorch/rl/actions/runs/8381809187/job/22954210899","head_branch":"fix-nonblocking-once-more","pr_number":2034,"head_sha":"14c7af95666e74335f34ec1ab1eb5acb10e1663f","failure_captures":["##[error]The operation was canceled."],"failure_lines":["##[error]The operation was canceled."],"failure_context":["+ sphinx-build ./source _local_build","+ MUJOCO_GL=egl","+ PYOPENGL_PLATFORM=egl","+ cd ./docs","+ cd ..","+ python3 -c 'from torchrl.envs.libs.dm_control import DMControlEnv","+ MUJOCO_GL=egl","+ PYOPENGL_PLATFORM=egl","+ cd _tmp","+ mkdir _tmp","+ python3 -m pip install -r docs/requirements.txt --quiet --root-user-action=ignore","+ python3 setup.py develop"],"time":"2024-03-21T23:15:39.187802Z"},{"workflowId":8381809198,"id":22954210377,"runnerName":"i-03d09597aaec2c98f","authorEmail":"vmoens@meta.com","name":"Habitat Tests on Linux / tests (3.9, 11.6) / linux-job","jobName":"tests (3.9, 11.6) / linux-job","conclusion":"failure","completed_at":"2024-03-21T21:25:56Z","html_url":"https://github.com/pytorch/rl/actions/runs/8381809198/job/22954210377","head_branch":"fix-nonblocking-once-more","pr_number":2034,"head_sha":"14c7af95666e74335f34ec1ab1eb5acb10e1663f","failure_captures":["RuntimeError: Command docker exec -t b7c352419d0a507f69b834cc0a7004de612f1c2f1b348a770c6181859327e703 /exec failed with exit code 139"],"failure_lines":["RuntimeError: Command docker exec -t b7c352419d0a507f69b834cc0a7004de612f1c2f1b348a770c6181859327e703 /exec failed with exit code 139"],"failure_context":["+ bash /pytorch/rl/.github/unittest/linux_libs/scripts_habitat/run_test.sh","+ bash /pytorch/rl/.github/unittest/linux_libs/scripts_habitat/install.sh","+ bash /pytorch/rl/.github/unittest/linux_libs/scripts_habitat/setup_env.sh","+ cp /pytorch/rl/.github/unittest/linux_libs/scripts_habitat/10_nvidia.json /usr/share/glvnd/egl_vendor.d/10_nvidia.json","+ this_dir=/pytorch/rl/.github/unittest/linux_libs/scripts_habitat","++ pwd","++ cd .github/unittest/linux_libs/scripts_habitat","+++ dirname .github/unittest/linux_libs/scripts_habitat/run_all.sh","+ apt-get dist-upgrade -y","+ apt-get install -y g++ gcc","+ apt-get install -y libglvnd0 libgl1 libglx0 libegl1 libgles2","+ apt-get install -y libglfw3 libgl1-mesa-glx libosmesa6 libglew-dev"],"time":"2024-03-21T21:26:01.089004Z"},{"workflowId":8381809188,"id":22954211255,"runnerName":"i-08d6272268b16d7b4","authorEmail":"vmoens@meta.com","name":"Unit-tests on Linux / tests-cpu (3.10) / linux-job","jobName":"tests-cpu (3.10) / linux-job","conclusion":"failure","completed_at":"2024-03-21T21:45:01Z","html_url":"https://github.com/pytorch/rl/actions/runs/8381809188/job/22954211255","head_branch":"fix-nonblocking-once-more","pr_number":2034,"head_sha":"14c7af95666e74335f34ec1ab1eb5acb10e1663f","failure_captures":["test/test_transforms.py::TestRemoveEmptySpecs::test_parallel_trans_env_check"],"failure_lines":["FAILED test/test_transfo
|
update-drci-comments
Node.js 16 actions are deprecated. Please update the following actions to use Node.js 20: actions/checkout@v3. For more information see: https://github.blog/changelog/2023-09-22-github-actions-transitioning-from-node-16-to-node-20/.
|