Skip to content

Fix Flaky Test - testGCScheduler in TestZkBucketDataAcessor (#3003) #3780

Fix Flaky Test - testGCScheduler in TestZkBucketDataAcessor (#3003)

Fix Flaky Test - testGCScheduler in TestZkBucketDataAcessor (#3003) #3780

Triggered via push February 18, 2025 19:05
Status Failure
Total duration 2h 10m 3s
Artifacts 1

Helix-CI.yml

on: push
Fit to window
Zoom out
Zoom in

Annotations

12 errors and 1 warning
TestSuite ► org.apache.helix.integration.rebalancer.TestInstanceOperation ► testEvacuationWithOfflineInstancesInCluster: helix-core/src/test/java/org/apache/helix/integration/rebalancer/TestInstanceOperation.java#L1637
Failed test found in: helix-core/target/surefire-reports/TEST-TestSuite.xml Error: java.lang.AssertionError: expected:<true> but was:<false>
Merge_PR_CI
Test failed: testEvacuationWithOfflineInstancesInCluster(org.apache.helix.integration.rebalancer.TestInstanceOperation) Time elapsed: 30.363 s <<< FAILURE!
Merge_PR_CI
Failed test were found and 'fail-on-error' option is set to true
Merge_PR_CI
Process completed with exit code 1.
TestSuite ► org.apache.helix.integration.rebalancer.TestInstanceOperation ► testSwapEvacuateAdd: helix-core/src/test/java/org/apache/helix/integration/rebalancer/TestInstanceOperation.java#L1637
Failed test found in: helix-core/target/surefire-reports/TEST-TestSuite.xml Error: java.lang.AssertionError: expected:<true> but was:<false>
TestSuite ► org.apache.helix.integration.rebalancer.TestInstanceOperation ► testEvacuateWithDisabledPartition: helix-core/src/test/java/org/apache/helix/integration/rebalancer/TestInstanceOperation.java#L1637
Failed test found in: helix-core/target/surefire-reports/TEST-TestSuite.xml Error: java.lang.AssertionError: expected:<true> but was:<false>
TestSuite ► org.apache.helix.messaging.handling.TestResourceThreadpoolSize ► testBatchMessageThreadPoolSize: helix-core/src/test/java/org/apache/helix/messaging/handling/TestResourceThreadpoolSize.java#L184
Failed test found in: helix-core/target/surefire-reports/TEST-TestSuite.xml Error: org.testng.internal.thread.ThreadTimeoutException: Method org.testng.internal.TestNGMethod.testBatchMessageThreadPoolSize() didn't finish within the time-out 900000
TestSuite ► org.apache.helix.integration.rebalancer.TestInstanceOperation ► testEvacuateWithDisabledPartition: helix-core/src/test/java/org/apache/helix/integration/rebalancer/TestInstanceOperation.java#L1637
Failed test found in: helix-core/target/surefire-reports/TEST-TestSuite.xml Error: java.lang.AssertionError: expected:<true> but was:<false>
TestSuite ► org.apache.helix.integration.manager.TestConsecutiveZkSessionExpiry ► testDistributedController: helix-core/src/test/java/org/apache/helix/integration/manager/TestConsecutiveZkSessionExpiry.java#L228
Failed test found in: helix-core/target/surefire-reports/TEST-TestSuite.xml Error: java.lang.AssertionError: expected:<true> but was:<false>
TestSuite ► org.apache.helix.integration.task.TestIndependentTaskRebalancer ► testThresholdFailure: helix-core/src/test/java/org/apache/helix/integration/task/TestIndependentTaskRebalancer.java#L174
Failed test found in: helix-core/target/surefire-reports/TEST-TestSuite.xml Error: java.lang.AssertionError: expected:<true> but was:<false>
TestSuite ► org.apache.helix.integration.rebalancer.TestInstanceOperation ► testSwapEvacuateAdd: helix-core/src/test/java/org/apache/helix/integration/rebalancer/TestInstanceOperation.java#L1637
Failed test found in: helix-core/target/surefire-reports/TEST-TestSuite.xml Error: java.lang.AssertionError: expected:<true> but was:<false>
TestSuite ► org.apache.helix.integration.TestZkConnectionLost ► testDisconnectWhenConnectionBreak: helix-core/src/test/java/org/apache/helix/integration/TestZkConnectionLost.java#L140
Failed test found in: helix-core/target/surefire-reports/TEST-TestSuite.xml Error: org.testng.internal.thread.ThreadTimeoutException: Method org.testng.internal.TestNGMethod.testDisconnectWhenConnectionBreak() didn't finish within the time-out 900000
Merge_PR_CI
Test report summary exceeded limit of 65535 bytes and will be trimmed

Artifacts

Produced during runtime
Name Size
surefire-reports
899 KB